Reaction Details
TargetBeta-galactoside alpha-2,6-sialyltransferase 1
LigandBDBM50127706
Substrate/Competitorn/a
Meas. Tech.ChEMBL_1522838 (CHEMBL3630397)
Ki 436±n/a nM
Citation Li, WNiu, YXiong, DCCao, XYe, XS Highly Substituted Cyclopentane-CMP Conjugates as Potent Sialyltransferase Inhibitors. J Med Chem58:7972-90 (2015) 
 
Beta-galactoside alpha-2,6-sialyltransferase 1
Name:Beta-galactoside alpha-2,6-sialyltransferase 1
Type:PROTEIN
Mol. Mass.:46622.19
Organism:Homo sapiens (Human)
Description:ChEMBL_109837
Residue:406
BDBM50127706
NameBDBM50127706
Synonyms:CHEMBL3629692
TypeSmall organic molecule
Emp. Form.C24H31N4Na3O13P2
Mol. Mass.714.4388
SMILES[Na+].[Na+].[Na+].[H][C@@]1(C[C@H](NC(C)=O)[C@@H](C1)OCc1ccccc1)C(OP([O-])(=O)OC[C@H]1O[C@H]([C@H](O)[C@@H]1O)n1ccc(N)nc1=O)P([O-])([O-])=O