Reaction Details
TargetMitogen-activated protein kinase kinase kinase 12
LigandBDBM50128340
Substrate/Competitorn/a
Meas. Tech.ChEMBL_1523511 (CHEMBL3631015)
Ki 569±n/a nM
Citation Patel, SHarris, SFGibbons, PDeshmukh, GGustafson, AKellar, TLin, HLiu, XLiu, YLiu, YMa, CScearce-Levie, KGhosh, ASShin, YGSolanoy, HWang, JWang, BYin, JSiu, MLewcock, JW Scaffold-Hopping and Structure-Based Discovery of Potent, Selective, And Brain Penetrant N-(1H-Pyrazol-3-yl)pyridin-2-amine Inhibitors of Dual Leucine Zipper Kinase (DLK, MAP3K12). J Med Chem58:8182-99 (2015) 
 
Mitogen-activated protein kinase kinase kinase 12
Name:Mitogen-activated protein kinase kinase kinase 12
Type:PROTEIN
Mol. Mass.:93216.56
Organism:Homo sapiens (Human)
Description:ChEMBL_1460553
Residue:859
BDBM50128340
NameBDBM50128340
Synonyms:CHEMBL3629173
TypeSmall organic molecule
Emp. Form.C20H23N5OS
Mol. Mass.381.495
SMILESN#Cc1ccnc(Nc2nc(C3CC3)c(s2)C2CCN(CC2)C2COC2)c1