Reaction Details
TargetMetallo-beta-lactamase VIM-2
LigandBDBM50129031
Substrate/Competitorn/a
Meas. Tech.ChEMBL_1523078 (CHEMBL3631655)
IC50>1000000±n/a nM
Citation Christopeit, TCarlsen, TJHelland, RLeiros, HK Discovery of Novel Inhibitor Scaffolds against the Metallo-ß-lactamase VIM-2 by Surface Plasmon Resonance (SPR) Based Fragment Screening. J Med Chem58:8671-82 (2015) 
 
Metallo-beta-lactamase VIM-2
Name:Metallo-beta-lactamase VIM-2
Type:Protein
Mol. Mass.:28318.00
Organism:Pseudomonas aeruginosa (g-Proteobacteria)
Description:n/a
Residue:266
BDBM50129031
NameBDBM50129031
Synonyms:CHEMBL1879588
TypeSmall organic molecule
Emp. Form.C14H12O2
Mol. Mass.212.2439
SMILESOC(=O)c1ccccc1Cc1ccccc1