Reaction Details
TargetMetallo-beta-lactamase VIM-2
LigandBDBM50129032
Substrate/Competitorn/a
Meas. Tech.ChEMBL_1523080 (CHEMBL3631657)
Kd 9000±n/a nM
Citation Christopeit, TCarlsen, TJHelland, RLeiros, HK Discovery of Novel Inhibitor Scaffolds against the Metallo-ß-lactamase VIM-2 by Surface Plasmon Resonance (SPR) Based Fragment Screening. J Med Chem58:8671-82 (2015) 
 
Metallo-beta-lactamase VIM-2
Name:Metallo-beta-lactamase VIM-2
Type:Protein
Mol. Mass.:28318.00
Organism:Pseudomonas aeruginosa (g-Proteobacteria)
Description:n/a
Residue:266
BDBM50129032
NameBDBM50129032
Synonyms:CHEMBL82115
TypeSmall organic molecule
Emp. Form.C14H9FO3
Mol. Mass.244.2179
SMILESOC(=O)c1ccccc1C(=O)c1ccc(F)cc1