Reaction Details
TargetMetallo-beta-lactamase VIM-2
LigandBDBM50129081
Substrate/Competitorn/a
Meas. Tech.ChEMBL_1523080 (CHEMBL3631657)
Kd 274000±n/a nM
Citation Christopeit, TCarlsen, TJHelland, RLeiros, HK Discovery of Novel Inhibitor Scaffolds against the Metallo-ß-lactamase VIM-2 by Surface Plasmon Resonance (SPR) Based Fragment Screening. J Med Chem58:8671-82 (2015) 
 
Metallo-beta-lactamase VIM-2
Name:Metallo-beta-lactamase VIM-2
Type:Protein
Mol. Mass.:28318.00
Organism:Pseudomonas aeruginosa (g-Proteobacteria)
Description:n/a
Residue:266
BDBM50129081
NameBDBM50129081
Synonyms:CHEBI:33070 | Indole-3-Butyric Acid
TypeSmall organic molecule
Emp. Form.C12H13NO2
Mol. Mass.203.2371
SMILESOC(=O)CCCc1c[nH]c2ccccc12