Reaction Details
TargetHistone deacetylase 1
LigandBDBM50129135
Substrate/Competitorn/a
Meas. Tech.ChEMBL_1523183 (CHEMBL3632099)
IC50 1040±n/a nM
Citation Ni, MEsposito, ERaj, VPMuzi, LZunino, FZuco, VCominetti, DPenco, SDal Pozzo, A New macrocyclic analogs of the natural histone deacetylase inhibitor FK228; design, synthesis and preliminary biological evaluation. Bioorg Med Chem23:6785-93 (2015) 
 
Histone deacetylase 1
Name:Histone deacetylase 1
Type:Enzyme
Mol. Mass.:55090.27
Organism:Homo sapiens (Human)
Description:Q13547
Residue:482
BDBM50129135
NameBDBM50129135
Synonyms:CHEMBL3628323
TypeSmall organic molecule
Emp. Form.C29H42N8O6S
Mol. Mass.630.759
SMILESCC(C)[C@H]1NC(=O)[C@@H](Cc2cn(C)cn2)NC(=O)[C@H](NC(=O)C[C@H](OC(=O)Cn2cc1nn2)\C=C\CCSC(C)=O)C(C)C