Reaction Details
TargetHistone deacetylase 8
LigandBDBM50129134
Substrate/Competitorn/a
Meas. Tech.ChEMBL_1523185 (CHEMBL3632101)
IC50 1800±n/a nM
Citation Ni, MEsposito, ERaj, VPMuzi, LZunino, FZuco, VCominetti, DPenco, SDal Pozzo, A New macrocyclic analogs of the natural histone deacetylase inhibitor FK228; design, synthesis and preliminary biological evaluation. Bioorg Med Chem23:6785-93 (2015) 
 
Histone deacetylase 8
Name:Histone deacetylase 8
Type:Enzyme
Mol. Mass.:41749.60
Organism:Homo sapiens (Human)
Description:Q9BY41
Residue:377
BDBM50129134
NameBDBM50129134
Synonyms:CHEMBL3628322
TypeSmall organic molecule
Emp. Form.C31H42N6O6S
Mol. Mass.626.767
SMILESCC(C)[C@H]1NC(=O)[C@@H](Cc2ccccc2)NC(=O)[C@H](NC(=O)C[C@H](OC(=O)Cn2cc1nn2)\C=C\CCSC(C)=O)C(C)C