Reaction Details
TargetMuscarinic acetylcholine receptor M3
LigandBDBM50129247
Substrate/Competitorn/a
Meas. Tech.ChEMBL_1523365 (CHEMBL3630285)
Ki 3290±n/a nM
Citation Lee, NRZhang, XDarna, MDwoskin, LPZheng, G Muscarinic acetylcholine receptor binding affinities of pethidine analogs. Bioorg Med Chem Lett25:5032-5 (2015) 
 
Muscarinic acetylcholine receptor M3
Name:Muscarinic acetylcholine receptor M3
Type:Enzyme
Mol. Mass.:66151.03
Organism:Homo sapiens (Human)
Description:P20309
Residue:590
BDBM50129247
NameBDBM50129247
Synonyms:CHEMBL3629532
TypeSmall organic molecule
Emp. Form.C22H28N2O2
Mol. Mass.352.4699
SMILESCOc1ccc(CCNC(=O)C2(CCN(C)CC2)c2ccccc2)cc1