Reaction Details
TargetMuscarinic acetylcholine receptor M5
LigandBDBM50129251
Substrate/Competitorn/a
Meas. Tech.ChEMBL_1523366 (CHEMBL3630286)
Ki 1810±n/a nM
Citation Lee, NRZhang, XDarna, MDwoskin, LPZheng, G Muscarinic acetylcholine receptor binding affinities of pethidine analogs. Bioorg Med Chem Lett25:5032-5 (2015) 
 
Muscarinic acetylcholine receptor M5
Name:Muscarinic acetylcholine receptor M5
Type:PROTEIN
Mol. Mass.:60102.35
Organism:Homo sapiens (Human)
Description:ChEMBL_1517990
Residue:532
BDBM50129251
NameBDBM50129251
Synonyms:CHEMBL3627739
TypeSmall organic molecule
Emp. Form.C23H30N2O2
Mol. Mass.366.4965
SMILESCOc1ccc(CCC(=O)NCC2(CCN(C)CC2)c2ccccc2)cc1