Reaction Details
TargetBeta-secretase 1
LigandBDBM50129288
Substrate/Competitorn/a
Meas. Tech.ChEMBL_1523399 (CHEMBL3630426)
pH6.4±n/a
Ki 300±n/a nM
Commentsextracted
Citation Boy, KMGuernon, JMWu, YJZhang, YShi, JZhai, WZhu, SGerritz, SWToyn, JHMeredith, JEBarten, DMBurton, CRAlbright, CFGood, ACGrace, JELentz, KAOlson, REMacor, JEThompson, LA Macrocyclic prolinyl acyl guanidines as inhibitors of฿-secretase (BACE). Bioorg Med Chem Lett25:5040-7 (2015) 
 
Beta-secretase 1
Name:Beta-secretase 1
Type:Protein
Mol. Mass.:55755.10
Organism:Homo sapiens (Human)
Description:P56817
Residue:501
BDBM50129288
NameBDBM50129288
Synonyms:CHEMBL3627969
TypeSmall organic molecule
Emp. Form.C22H25Cl2N5O3
Mol. Mass.478.372
SMILESCOc1ccc(cc1)N1CCC[C@H]1C(=O)\N=C(/N)NCc1cc(Cl)c(NC(C)=O)c(Cl)c1