Reaction Details
TargetBeta-secretase 1
LigandBDBM50129292
Substrate/Competitorn/a
Meas. Tech.ChEMBL_1523399 (CHEMBL3630426)
pH6.4±n/a
Ki 360±n/a nM
Commentsextracted
Citation Boy, KMGuernon, JMWu, YJZhang, YShi, JZhai, WZhu, SGerritz, SWToyn, JHMeredith, JEBarten, DMBurton, CRAlbright, CFGood, ACGrace, JELentz, KAOlson, REMacor, JEThompson, LA Macrocyclic prolinyl acyl guanidines as inhibitors of฿-secretase (BACE). Bioorg Med Chem Lett25:5040-7 (2015) 
 
Beta-secretase 1
Name:Beta-secretase 1
Type:Protein
Mol. Mass.:55755.10
Organism:Homo sapiens (Human)
Description:P56817
Residue:501
BDBM50129292
NameBDBM50129292
Synonyms:CHEMBL3628122
TypeSmall organic molecule
Emp. Form.C22H23Cl2N5O2
Mol. Mass.460.356
SMILESCC(=O)Nc1c(Cl)cc(CN\C(N)=N\C(=O)C2C3CC3CN2c2ccccc2)cc1Cl