Reaction Details
TargetBeta-secretase 1
LigandBDBM50129374
Substrate/Competitorn/a
Meas. Tech.ChEMBL_1523401 (CHEMBL3630428)
EC50 420±n/a nM
Citation Boy, KMGuernon, JMWu, YJZhang, YShi, JZhai, WZhu, SGerritz, SWToyn, JHMeredith, JEBarten, DMBurton, CRAlbright, CFGood, ACGrace, JELentz, KAOlson, REMacor, JEThompson, LA Macrocyclic prolinyl acyl guanidines as inhibitors of฿-secretase (BACE). Bioorg Med Chem Lett25:5040-7 (2015) 
 
Beta-secretase 1
Name:Beta-secretase 1
Type:Protein
Mol. Mass.:55755.10
Organism:Homo sapiens (Human)
Description:P56817
Residue:501
BDBM50129374
NameBDBM50129374
Synonyms:CHEMBL3628123
TypeSmall organic molecule
Emp. Form.C24H30Cl2N6O3
Mol. Mass.521.439
SMILESCOc1ccc(cc1)N1CCC[C@H]1C(=O)\N=C(/N)NCc1cc(Cl)c(NC(=O)CN(C)C)c(Cl)c1