Reaction Details
TargetBeta-secretase 1
LigandBDBM50129287
Substrate/Competitorn/a
Meas. Tech.ChEMBL_1523401 (CHEMBL3630428)
EC50 1700±n/a nM
Citation Boy, KMGuernon, JMWu, YJZhang, YShi, JZhai, WZhu, SGerritz, SWToyn, JHMeredith, JEBarten, DMBurton, CRAlbright, CFGood, ACGrace, JELentz, KAOlson, REMacor, JEThompson, LA Macrocyclic prolinyl acyl guanidines as inhibitors of฿-secretase (BACE). Bioorg Med Chem Lett25:5040-7 (2015) 
 
Beta-secretase 1
Name:Beta-secretase 1
Type:Protein
Mol. Mass.:55755.10
Organism:Homo sapiens (Human)
Description:P56817
Residue:501
BDBM50129287
NameBDBM50129287
Synonyms:CHEMBL3627968
TypeSmall organic molecule
Emp. Form.C22H22Cl2F3N5O2
Mol. Mass.516.344
SMILESCC(=O)Nc1c(Cl)cc(CN\C(N)=N\C(=O)[C@@H]2CCCN2c2ccc(cc2)C(F)(F)F)cc1Cl