Reaction Details
TargetBeta-secretase 1
LigandBDBM50129290
Substrate/Competitorn/a
Meas. Tech.ChEMBL_1523398 (CHEMBL3630425)
pH5±n/a
Ki 78±n/a nM
Commentsextracted
Citation Boy, KMGuernon, JMWu, YJZhang, YShi, JZhai, WZhu, SGerritz, SWToyn, JHMeredith, JEBarten, DMBurton, CRAlbright, CFGood, ACGrace, JELentz, KAOlson, REMacor, JEThompson, LA Macrocyclic prolinyl acyl guanidines as inhibitors of฿-secretase (BACE). Bioorg Med Chem Lett25:5040-7 (2015) 
 
Beta-secretase 1
Name:Beta-secretase 1
Type:Protein
Mol. Mass.:55755.10
Organism:Homo sapiens (Human)
Description:P56817
Residue:501
BDBM50129290
NameBDBM50129290
Synonyms:CHEMBL3627973
TypeSmall organic molecule
Emp. Form.C22H25Cl2N5O3
Mol. Mass.478.372
SMILESCO[C@@H]1C[C@H](N(C1)c1ccccc1)C(=O)\N=C(/N)NCc1cc(Cl)c(NC(C)=O)c(Cl)c1