Reaction Details
TargetBeta-secretase 1
LigandBDBM50129285
Substrate/Competitorn/a
Meas. Tech.ChEMBL_1523398 (CHEMBL3630425)
pH5±n/a
Ki 150±n/a nM
Commentsextracted
Citation Boy, KMGuernon, JMWu, YJZhang, YShi, JZhai, WZhu, SGerritz, SWToyn, JHMeredith, JEBarten, DMBurton, CRAlbright, CFGood, ACGrace, JELentz, KAOlson, REMacor, JEThompson, LA Macrocyclic prolinyl acyl guanidines as inhibitors of฿-secretase (BACE). Bioorg Med Chem Lett25:5040-7 (2015) 
 
Beta-secretase 1
Name:Beta-secretase 1
Type:Protein
Mol. Mass.:55755.10
Organism:Homo sapiens (Human)
Description:P56817
Residue:501
BDBM50129285
NameBDBM50129285
Synonyms:CHEMBL3627966
TypeSmall organic molecule
Emp. Form.C21H22Cl3N5O2
Mol. Mass.482.791
SMILESCC(=O)Nc1c(Cl)cc(CN\C(N)=N\C(=O)[C@@H]2CCCN2c2ccc(Cl)cc2)cc1Cl