Reaction Details
TargetCarbonic anhydrase 1
LigandBDBM50414251
Substrate/Competitorn/a
Meas. Tech.ChEBML_1523540
Temperature298.15±n/a K
Ki>10000±n/a nM
Commentsextracted
Citation Karioti, ACeruso, MCarta, FBilia, ARSupuran, CT New natural product carbonic anhydrase inhibitors incorporating phenol moieties. Bioorg Med Chem23:7219-25 (2015) 
 
Carbonic anhydrase 1
Name:Carbonic anhydrase 1
Type:Enzyme
Mol. Mass.:28873.37
Organism:Homo sapiens (Human)
Description:P00915
Residue:261
BDBM50414251
NameBDBM50414251
Synonyms:SALVIANOLIC ACID B
TypeSmall organic molecule
Emp. Form.C36H32O16
Mol. Mass.720.6297
SMILESOC(OC(Cc1ccc(O)c(O)c1)C(O)=O)C1C(Oc2cc(O)cc(\C=C\C(=O)OC(Cc3ccc(O)c(O)c3)C(O)=O)c12)c1ccc(O)c(O)c1