Reaction Details
TargetCarbonic anhydrase 1
LigandBDBM23420
Substrate/Competitorn/a
Meas. Tech.ChEBML_1523540
Temperature298.15±n/a K
Ki>10000±n/a nM
Commentsextracted
Citation Karioti, ACeruso, MCarta, FBilia, ARSupuran, CT New natural product carbonic anhydrase inhibitors incorporating phenol moieties. Bioorg Med Chem23:7219-25 (2015) 
 
Carbonic anhydrase 1
Name:Carbonic anhydrase 1
Type:Enzyme
Mol. Mass.:28873.37
Organism:Homo sapiens (Human)
Description:P00915
Residue:261
BDBM23420
NameBDBM23420
Synonyms:7,4′-Dihydroxy-isoflavone (3a) CHEMBL8145 US8552057, 7
Typeisoflavone
Emp. Form.C15H10O4
Mol. Mass.254.2375
SMILESOc1ccc(cc1)-c1coc2cc(O)ccc2c1=O