Reaction Details
TargetCarbonic anhydrase 2
LigandBDBM50129558
Substrate/Competitorn/a
Meas. Tech.ChEBML_1523541
Temperature298.15±n/a K
Ki>10000±n/a nM
Commentsextracted
Citation Karioti, ACeruso, MCarta, FBilia, ARSupuran, CT New natural product carbonic anhydrase inhibitors incorporating phenol moieties. Bioorg Med Chem23:7219-25 (2015) 
 
Carbonic anhydrase 2
Name:Carbonic anhydrase 2
Type:Enzyme
Mol. Mass.:29250.71
Organism:Homo sapiens (Human)
Description:P00918
Residue:260
BDBM50129558
NameBDBM50129558
Synonyms:CHEBI:8633 | Puerarin
TypeSmall organic molecule
Emp. Form.C21H20O9
Mol. Mass.416.3781
SMILES[H][C@]1(O[C@H](CO)[C@@H](O)[C@H](O)[C@H]1O)c1c(O)ccc2c1occ(-c1ccc(O)cc1)c2=O