Reaction Details
TargetCarbonic anhydrase 2
LigandBDBM50129557
Substrate/Competitorn/a
Meas. Tech.ChEBML_1523541
Temperature298.15±n/a K
Ki 6368±n/a nM
Commentsextracted
Citation Karioti, ACeruso, MCarta, FBilia, ARSupuran, CT New natural product carbonic anhydrase inhibitors incorporating phenol moieties. Bioorg Med Chem23:7219-25 (2015) 
 
Carbonic anhydrase 2
Name:Carbonic anhydrase 2
Type:Enzyme
Mol. Mass.:29250.71
Organism:Homo sapiens (Human)
Description:P00918
Residue:260
BDBM50129557
NameBDBM50129557
Synonyms:QUERCETIN-3-O-RHAMNOSIDE
TypeSmall organic molecule
Emp. Form.C21H20O11
Mol. Mass.448.3769
SMILESC[C@H]1O[C@H](Oc2c(oc3cc(O)cc(O)c3c2=O)-c2ccc(O)c(O)c2)[C@@H](O)[C@@H](O)[C@@H]1O