Reaction Details
TargetCarbonic anhydrase 7
LigandBDBM23418
Substrate/Competitorn/a
Meas. Tech.ChEBML_1523543
Temperature298.15±n/a K
Ki 3.3±n/a nM
Commentsextracted
Citation Karioti, ACeruso, MCarta, FBilia, ARSupuran, CT New natural product carbonic anhydrase inhibitors incorporating phenol moieties. Bioorg Med Chem23:7219-25 (2015) 
 
Carbonic anhydrase 7
Name:Carbonic anhydrase 7
Type:Enzyme
Mol. Mass.:29664.11
Organism:Homo sapiens (Human)
Description:Human cloned isozyme.
Residue:264
BDBM23418
NameBDBM23418
Synonyms:(2S)-5,7-dihydroxy-2-(3-hydroxy-4-methoxyphenyl)-3,4-dihydro-2H-1-benzopyran-4-one Hesperitin
Typeflavanone
Emp. Form.C16H14O6
Mol. Mass.302.2788
SMILESCOc1ccc(cc1O)[C@@H]1CC(=O)c2c(O)cc(O)cc2O1