Reaction Details
TargetCarbonic anhydrase 7
LigandBDBM23420
Substrate/Competitorn/a
Meas. Tech.ChEBML_1523543
Temperature298.15±n/a K
Ki 4.2±n/a nM
Commentsextracted
Citation Karioti, ACeruso, MCarta, FBilia, ARSupuran, CT New natural product carbonic anhydrase inhibitors incorporating phenol moieties. Bioorg Med Chem23:7219-25 (2015) 
 
Carbonic anhydrase 7
Name:Carbonic anhydrase 7
Type:Enzyme
Mol. Mass.:29664.11
Organism:Homo sapiens (Human)
Description:Human cloned isozyme.
Residue:264
BDBM23420
NameBDBM23420
Synonyms:7,4′-Dihydroxy-isoflavone (3a) CHEMBL8145 US8552057, 7
Typeisoflavone
Emp. Form.C15H10O4
Mol. Mass.254.2375
SMILESOc1ccc(cc1)-c1coc2cc(O)ccc2c1=O