Reaction Details
TargetCarbonic anhydrase 12
LigandBDBM23420
Substrate/Competitorn/a
Meas. Tech.ChEBML_1523544
Temperature298.15±n/a K
Ki 56±n/a nM
Commentsextracted
Citation Karioti, ACeruso, MCarta, FBilia, ARSupuran, CT New natural product carbonic anhydrase inhibitors incorporating phenol moieties. Bioorg Med Chem23:7219-25 (2015) 
 
Carbonic anhydrase 12
Name:Carbonic anhydrase 12
Type:Enzyme
Mol. Mass.:39456.00
Organism:Homo sapiens (Human)
Description:Catalytic domain of human cloned isozyme was used in the assay
Residue:354
BDBM23420
NameBDBM23420
Synonyms:7,4′-Dihydroxy-isoflavone (3a) CHEMBL8145 US8552057, 7
Typeisoflavone
Emp. Form.C15H10O4
Mol. Mass.254.2375
SMILESOc1ccc(cc1)-c1coc2cc(O)ccc2c1=O