Reaction Details
TargetDual specificity calcium/calmodulin-dependent 3',5'-cyclic nucleotide phosphodiesterase 1A
LigandBDBM50129817
Substrate/Competitorn/a
Meas. Tech.ChEMBL_1524104 (CHEMBL3631045)
IC50>100000±n/a nM
Citation Zhou, ZZGe, BCChen, YFShi, XDYang, XMXu, JP Catecholic amides as potential selective phosphodiesterase 4D inhibitors: Design, synthesis, pharmacological evaluation and structure-activity relationships. Bioorg Med Chem23:7332-9 (2015) 
 
Dual specificity calcium/calmodulin-dependent 3',5'-cyclic nucleotide phosphodiesterase 1A
Name:Dual specificity calcium/calmodulin-dependent 3',5'-cyclic nucleotide phosphodiesterase 1A
Type:Protein
Mol. Mass.:61245.69
Organism:Homo sapiens (Human)
Description:P54750
Residue:535
BDBM50129817
NameBDBM50129817
Synonyms:CHEMBL3628685
TypeSmall organic molecule
Emp. Form.C21H23F2NO4
Mol. Mass.391.4084
SMILESCOc1ccc(CNC(=O)c2ccc(OC(F)F)c(OC3CCCC3)c2)cc1