Reaction Details
TargetEpidermal growth factor receptor
LigandBDBM50129823
Substrate/Competitorn/a
Meas. Tech.ChEMBL_1524114 (CHEMBL3631055)
IC50 2980±n/a nM
Citation Ravez, SArsenlis, SBarczyk, ADupont, AFrédérick, RHesse, SKirsch, GDepreux, PGoossens, L Synthesis and biological evaluation of di-aryl urea derivatives as c-Kit inhibitors. Bioorg Med Chem23:7340-7 (2015) 
 
Epidermal growth factor receptor
Name:Epidermal growth factor receptor
Type:Receptor Kinase Domain
Mol. Mass.:134279.59
Organism:Homo sapiens (Human)
Description:P00533
Residue:1210
BDBM50129823
NameBDBM50129823
Synonyms:CHEMBL3628791
TypeSmall organic molecule
Emp. Form.C12H7ClFN3S
Mol. Mass.279.72
SMILESFc1ccc(Nc2ncnc3sccc23)cc1Cl