Reaction Details
TargetEpidermal growth factor receptor
LigandBDBM50129826
Substrate/Competitorn/a
Meas. Tech.ChEMBL_1524114 (CHEMBL3631055)
IC50>10000±n/a nM
Citation Ravez, SArsenlis, SBarczyk, ADupont, AFrédérick, RHesse, SKirsch, GDepreux, PGoossens, L Synthesis and biological evaluation of di-aryl urea derivatives as c-Kit inhibitors. Bioorg Med Chem23:7340-7 (2015) 
 
Epidermal growth factor receptor
Name:Epidermal growth factor receptor
Type:Receptor Kinase Domain
Mol. Mass.:134279.59
Organism:Homo sapiens (Human)
Description:P00533
Residue:1210
BDBM50129826
NameBDBM50129826
Synonyms:CHEMBL3628794
TypeSmall organic molecule
Emp. Form.C16H16N4O2S
Mol. Mass.328.389
SMILESCCOC(=O)Nc1ccc(Nc2ncnc3sccc23)cc1C