Reaction Details
TargetEpidermal growth factor receptor
LigandBDBM50129829
Substrate/Competitorn/a
Meas. Tech.ChEMBL_1524114 (CHEMBL3631055)
IC50>10000±n/a nM
Citation Ravez, SArsenlis, SBarczyk, ADupont, AFrédérick, RHesse, SKirsch, GDepreux, PGoossens, L Synthesis and biological evaluation of di-aryl urea derivatives as c-Kit inhibitors. Bioorg Med Chem23:7340-7 (2015) 
 
Epidermal growth factor receptor
Name:Epidermal growth factor receptor
Type:Receptor Kinase Domain
Mol. Mass.:134279.59
Organism:Homo sapiens (Human)
Description:P00533
Residue:1210
BDBM50129829
NameBDBM50129829
Synonyms:CHEMBL3628797
TypeSmall organic molecule
Emp. Form.C21H16BrN5O
Mol. Mass.434.289
SMILESBrc1cccc(NC(=O)Nc2ccc(Nc3ncnc4ccccc34)cc2)c1