Reaction Details
TargetProto-oncogene tyrosine-protein kinase Src
LigandBDBM50129837
Substrate/Competitorn/a
Meas. Tech.ChEMBL_1524118 (CHEMBL3631059)
IC50 8460±n/a nM
Citation Ravez, SArsenlis, SBarczyk, ADupont, AFrédérick, RHesse, SKirsch, GDepreux, PGoossens, L Synthesis and biological evaluation of di-aryl urea derivatives as c-Kit inhibitors. Bioorg Med Chem23:7340-7 (2015) 
 
Proto-oncogene tyrosine-protein kinase Src
Name:Proto-oncogene tyrosine-protein kinase Src
Type:Protein
Mol. Mass.:59838.60
Organism:Homo sapiens (Human)
Description:P12931
Residue:536
BDBM50129837
NameBDBM50129837
Synonyms:CHEMBL3628811
TypeSmall organic molecule
Emp. Form.C23H19BrN4O2S
Mol. Mass.495.392
SMILESBrc1cccc(NC(=O)Nc2ccc(Oc3ncnc4sc5CCCCc5c34)cc2)c1