Reaction Details
TargetMast/stem cell growth factor receptor Kit
LigandBDBM50129837
Substrate/Competitorn/a
Meas. Tech.ChEMBL_1524122 (CHEMBL3631063)
IC50 17±n/a nM
Citation Ravez, SArsenlis, SBarczyk, ADupont, AFrédérick, RHesse, SKirsch, GDepreux, PGoossens, L Synthesis and biological evaluation of di-aryl urea derivatives as c-Kit inhibitors. Bioorg Med Chem23:7340-7 (2015) 
 
Mast/stem cell growth factor receptor Kit
Name:Mast/stem cell growth factor receptor Kit
Type:Protein
Mol. Mass.:109869.37
Organism:Homo sapiens (Human)
Description:P10721
Residue:976
BDBM50129837
NameBDBM50129837
Synonyms:CHEMBL3628811
TypeSmall organic molecule
Emp. Form.C23H19BrN4O2S
Mol. Mass.495.392
SMILESBrc1cccc(NC(=O)Nc2ccc(Oc3ncnc4sc5CCCCc5c34)cc2)c1