Reaction Details
TargetPlatelet-derived growth factor receptor alpha/beta
LigandBDBM13530
Substrate/Competitorn/a
Meas. Tech.ChEMBL_1524125 (CHEMBL3631066)
IC50 400±n/a nM
Citation Ravez, SArsenlis, SBarczyk, ADupont, AFrédérick, RHesse, SKirsch, GDepreux, PGoossens, L Synthesis and biological evaluation of di-aryl urea derivatives as c-Kit inhibitors. Bioorg Med Chem23:7340-7 (2015) 
 
Platelet-derived growth factor receptor alpha/beta
Name:Platelet-derived growth factor receptor alpha/beta
Type:n/a
Mol. Mass.:n/a
Description:ASSAY_ID of EBI is 29498
Components:This complex has 2 components.
Component 1
Name:Platelet-derived growth factor receptor beta
Synonyms:Beta-type platelet-derived growth factor receptor CD140b antigen PDGF Receptor Substrate PDGFR PDGFR-1 PDGFRB PGFRB_HUMAN Platelet-derived growth factor receptor 1 Platelet-derived growth factor receptor beta (PDGFR-beta) Platelet-derived growth factor receptor beta (PDGFRbeta) | VHL/PDGFRB
Type:Enzyme
Mol. Mass.:123922.25
Organism:Homo sapiens (Human)
Description:P09619
Residue:1106
Component 2
Name:Platelet-derived growth factor receptor alpha
Synonyms:Alpha-type platelet-derived growth factor receptor PDGFRA PGFRA_HUMAN Platelet-derived growth factor receptor alpha (PDGFRA) RHEPDGFRA
Type:Protein
Mol. Mass.:122633.38
Organism:Homo sapiens (Human)
Description:P16234
Residue:1089
BDBM13530
NameBDBM13530
Synonyms:4-[(4-methylpiperazin-1-yl)methyl]-N-[4-methyl-3-[(4-pyridin-3-ylpyrimidin-2-yl)amino]phenyl]benzamide Gleevec Imatinib, 21 STI-571 US10906896, Cpd imatinib US11725005, Compound imatinib cid_5291 med.21724, Compound 6
TypeSmall organic molecule
Emp. Form.C29H31N7O
Mol. Mass.493.6027
SMILESCN1CCN(Cc2ccc(cc2)C(=O)Nc2ccc(C)c(Nc3nccc(n3)-c3cccnc3)c2)CC1