Reaction Details
TargetRAF proto-oncogene serine/threonine-protein kinase
LigandBDBM50129829
Substrate/Competitorn/a
Meas. Tech.ChEMBL_1524117 (CHEMBL3631058)
IC50>10000±n/a nM
Citation Ravez, SArsenlis, SBarczyk, ADupont, AFrédérick, RHesse, SKirsch, GDepreux, PGoossens, L Synthesis and biological evaluation of di-aryl urea derivatives as c-Kit inhibitors. Bioorg Med Chem23:7340-7 (2015) 
 
RAF proto-oncogene serine/threonine-protein kinase
Name:RAF proto-oncogene serine/threonine-protein kinase
Type:Serine/threonine-protein kinase
Mol. Mass.:73082.52
Organism:Homo sapiens (Human)
Description:P04049
Residue:648
BDBM50129829
NameBDBM50129829
Synonyms:CHEMBL3628797
TypeSmall organic molecule
Emp. Form.C21H16BrN5O
Mol. Mass.434.289
SMILESBrc1cccc(NC(=O)Nc2ccc(Nc3ncnc4ccccc34)cc2)c1