Reaction Details
TargetHepatocyte growth factor receptor
LigandBDBM50129830
Substrate/Competitorn/a
Meas. Tech.ChEMBL_1524116 (CHEMBL3631057)
IC50>10000±n/a nM
Citation Ravez, SArsenlis, SBarczyk, ADupont, AFrédérick, RHesse, SKirsch, GDepreux, PGoossens, L Synthesis and biological evaluation of di-aryl urea derivatives as c-Kit inhibitors. Bioorg Med Chem23:7340-7 (2015) 
 
Hepatocyte growth factor receptor
Name:Hepatocyte growth factor receptor
Type:Protein
Mol. Mass.:155559.73
Organism:Homo sapiens (Human)
Description:P08581
Residue:1390
BDBM50129830
NameBDBM50129830
Synonyms:CHEMBL3628798
TypeSmall organic molecule
Emp. Form.C19H14BrN5OS
Mol. Mass.440.316
SMILESBrc1cccc(NC(=O)Nc2ccc(Nc3ncnc4sccc34)cc2)c1