Reaction Details
TargetVascular endothelial growth factor receptor 2
LigandBDBM50129842
Substrate/Competitorn/a
Meas. Tech.ChEMBL_1524115 (CHEMBL3631056)
IC50 34±n/a nM
Citation Ravez, SArsenlis, SBarczyk, ADupont, AFrédérick, RHesse, SKirsch, GDepreux, PGoossens, L Synthesis and biological evaluation of di-aryl urea derivatives as c-Kit inhibitors. Bioorg Med Chem23:7340-7 (2015) 
 
Vascular endothelial growth factor receptor 2
Name:Vascular endothelial growth factor receptor 2
Type:Receptor Tyrosine Kinase
Mol. Mass.:151510.97
Organism:Homo sapiens (Human)
Description:P35968
Residue:1356
BDBM50129842
NameBDBM50129842
Synonyms:CHEMBL3628906
TypeSmall organic molecule
Emp. Form.C24H21BrN4O2S
Mol. Mass.509.418
SMILESCc1cc(Oc2ncnc3sc4CCCCc4c23)ccc1NC(=O)Nc1cccc(Br)c1