Reaction Details
TargetVascular endothelial growth factor receptor 2
LigandBDBM50129843
Substrate/Competitorn/a
Meas. Tech.ChEMBL_1524115 (CHEMBL3631056)
IC50 9.0±n/a nM
Citation Ravez, SArsenlis, SBarczyk, ADupont, AFrédérick, RHesse, SKirsch, GDepreux, PGoossens, L Synthesis and biological evaluation of di-aryl urea derivatives as c-Kit inhibitors. Bioorg Med Chem23:7340-7 (2015) 
 
Vascular endothelial growth factor receptor 2
Name:Vascular endothelial growth factor receptor 2
Type:Receptor Tyrosine Kinase
Mol. Mass.:151510.97
Organism:Homo sapiens (Human)
Description:P35968
Residue:1356
BDBM50129843
NameBDBM50129843
Synonyms:CHEMBL3628810
TypeSmall organic molecule
Emp. Form.C19H12BrClN4O2S
Mol. Mass.475.746
SMILESClc1cc(Oc2ncnc3sccc23)ccc1NC(=O)Nc1cccc(Br)c1