Reaction Details
TargetVascular endothelial growth factor receptor 2
LigandBDBM50129836
Substrate/Competitorn/a
Meas. Tech.ChEMBL_1524115 (CHEMBL3631056)
IC50 710±n/a nM
Citation Ravez, SArsenlis, SBarczyk, ADupont, AFrédérick, RHesse, SKirsch, GDepreux, PGoossens, L Synthesis and biological evaluation of di-aryl urea derivatives as c-Kit inhibitors. Bioorg Med Chem23:7340-7 (2015) 
 
Vascular endothelial growth factor receptor 2
Name:Vascular endothelial growth factor receptor 2
Type:Receptor Tyrosine Kinase
Mol. Mass.:151510.97
Organism:Homo sapiens (Human)
Description:P35968
Residue:1356
BDBM50129836
NameBDBM50129836
Synonyms:CHEMBL3628804
TypeSmall organic molecule
Emp. Form.C18H17N3O3
Mol. Mass.323.3459
SMILESCCOC(=O)Nc1ccc(Oc2ncnc3ccccc23)cc1C