Reaction Details
TargetVascular endothelial growth factor receptor 2
LigandBDBM50129834
Substrate/Competitorn/a
Meas. Tech.ChEMBL_1524115 (CHEMBL3631056)
IC50 3500±n/a nM
Citation Ravez, SArsenlis, SBarczyk, ADupont, AFrédérick, RHesse, SKirsch, GDepreux, PGoossens, L Synthesis and biological evaluation of di-aryl urea derivatives as c-Kit inhibitors. Bioorg Med Chem23:7340-7 (2015) 
 
Vascular endothelial growth factor receptor 2
Name:Vascular endothelial growth factor receptor 2
Type:Receptor Tyrosine Kinase
Mol. Mass.:151510.97
Organism:Homo sapiens (Human)
Description:P35968
Residue:1356
BDBM50129834
NameBDBM50129834
Synonyms:CHEMBL3628802
TypeSmall organic molecule
Emp. Form.C16H12ClFN2OS
Mol. Mass.334.796
SMILESFc1ccc(Oc2ncnc3sc4CCCCc4c23)cc1Cl