Reaction Details
TargetCytochrome P450 2D6
LigandBDBM50130203
Substrate/Competitorn/a
Meas. Tech.ChEMBL_1525142 (CHEMBL3635480)
Ki 122±n/a nM
Citation van Breemen, RB Development of Safe and Effective Botanical Dietary Supplements. J Med Chem58:8360-72 (2015) 
 
Cytochrome P450 2D6
Name:Cytochrome P450 2D6
Type:Protein
Mol. Mass.:55774.82
Organism:Homo sapiens (Human)
Description:P10635
Residue:497
BDBM50130203
NameBDBM50130203
Synonyms:Allocryptopine CHEBI:17390
TypeSmall organic molecule
Emp. Form.C21H23NO5
Mol. Mass.369.411
SMILESCOc1ccc2CC(=O)c3cc4OCOc4cc3CCN(C)Cc2c1OC