Reaction Details
TargetProthrombin
LigandBDBM50130211
Substrate/Competitorn/a
Meas. Tech.ChEMBL_1525155 (CHEMBL3635493)
Ki 270±n/a nM
Citation Gillis, EPEastman, KJHill, MDDonnelly, DJMeanwell, NA Applications of Fluorine in Medicinal Chemistry. J Med Chem58:8315-59 (2015) 
 
Prothrombin
Name:Prothrombin
Type:Protein
Mol. Mass.:70029.57
Organism:Homo sapiens (Human)
Description:P00734
Residue:622
BDBM50130211
NameBDBM50130211
Synonyms:CHEMBL3632869
TypeSmall organic molecule
Emp. Form.C23H25ClN4O2
Mol. Mass.424.923
SMILESCl.[H][C@]12C3CCCN3[C@@H](c3ccc(cc3)C(N)=N)[C@@]1([H])C(=O)N(Cc1ccccc1)C2=O