Reaction Details
TargetProthrombin
LigandBDBM50130296
Substrate/Competitorn/a
Meas. Tech.ChEMBL_1525156 (CHEMBL3635494)
Ki 15±n/a nM
Citation Gillis, EPEastman, KJHill, MDDonnelly, DJMeanwell, NA Applications of Fluorine in Medicinal Chemistry. J Med Chem58:8315-59 (2015) 
 
Prothrombin
Name:Prothrombin
Type:Protein
Mol. Mass.:70029.57
Organism:Homo sapiens (Human)
Description:P00734
Residue:622
BDBM50130296
NameBDBM50130296
Synonyms:CHEMBL3632876
TypeSmall organic molecule
Emp. Form.C27H34N4O2
Mol. Mass.446.5845
SMILES[H][C@]12C3CCCN3[C@@H](c3ccc(cc3)C(N)=N)[C@@]1([H])C(=O)N(Cc1ccc(OC)cc1)[C@@H]2C(C)C