Reaction Details
TargetProthrombin
LigandBDBM50067797
Substrate/Competitorn/a
Meas. Tech.ChEMBL_1525158 (CHEMBL3635496)
Ki 0.800000±n/a nM
Citation Gillis, EPEastman, KJHill, MDDonnelly, DJMeanwell, NA Applications of Fluorine in Medicinal Chemistry. J Med Chem58:8315-59 (2015) 
 
Prothrombin
Name:Prothrombin
Type:Protein
Mol. Mass.:70029.57
Organism:Homo sapiens (Human)
Description:P00734
Residue:622
BDBM50067797
NameBDBM50067797
Synonyms:CHEMBL19080 N-(6-Amino-2-methyl-pyridin-3-ylmethyl)-2-(6-methyl-2-oxo-3-phenethylamino-2H-pyrazin-1-yl)-acetamide | US11584714, Compound 1488
TypeSmall organic molecule
Emp. Form.C22H26N6O2
Mol. Mass.406.4808
SMILESCc1nc(N)ccc1CNC(=O)Cn1c(C)cnc(NCCc2ccccc2)c1=O