Reaction Details
TargetDipeptidyl peptidase 4
LigandBDBM50130303
Substrate/Competitorn/a
Meas. Tech.ChEMBL_1525147 (CHEMBL3635485)
IC50 290±n/a nM
Citation Gillis, EPEastman, KJHill, MDDonnelly, DJMeanwell, NA Applications of Fluorine in Medicinal Chemistry. J Med Chem58:8315-59 (2015) 
 
Dipeptidyl peptidase 4
Name:Dipeptidyl peptidase 4
Type:Enzyme
Mol. Mass.:88271.01
Organism:Homo sapiens (Human)
Description:P27487
Residue:766
BDBM50130303
NameBDBM50130303
Synonyms:CHEMBL3632866
TypeSmall organic molecule
Emp. Form.C11H18FN3O
Mol. Mass.227.2785
SMILESCC[C@@H](C)[C@H](N)C(=O)N1C[C@H](F)C[C@H]1C#N