Reaction Details
TargetVascular endothelial growth factor receptor 2
LigandBDBM50130403
Substrate/Competitorn/a
Meas. Tech.ChEMBL_1525354 (CHEMBL3636171)
IC50 49±n/a nM
Citation Vojticková, MDobia?, JHanquet, GAddová, GCetin-Atalay, RYildirim, DCBohác, A Ynamide Click chemistry in development of triazole VEGFR2 TK modulators. Eur J Med Chem103:105-22 (2015) 
 
Vascular endothelial growth factor receptor 2
Name:Vascular endothelial growth factor receptor 2
Type:Receptor Tyrosine Kinase
Mol. Mass.:151510.97
Organism:Homo sapiens (Human)
Description:P35968
Residue:1356
BDBM50130403
NameBDBM50130403
Synonyms:CHEMBL3633689
TypeSmall organic molecule
Emp. Form.C23H18F3N7O4
Mol. Mass.513.4287
SMILESCNC(=O)c1cc(Oc2ccc(NC(=O)Nc3cc(ccc3-n3ccnn3)C(F)(F)F)cc2)cc[n+]1[O-]