Reaction Details
TargetSodium channel protein type 1 subunit alpha
LigandBDBM50130519
Substrate/Competitorn/a
Meas. Tech.ChEMBL_1525512 (CHEMBL3636865)
IC50 5400±n/a nM
Citation Suzuki, SKuroda, TKimoto, HDomon, YKubota, KKitano, YYokoyama, TShimizugawa, ASugita, RKoishi, RAsano, DTamaki, KShinozuka, TKobayashi, H Discovery of (phenoxy-2-hydroxypropyl)piperidines as a novel class of voltage-gated sodium channel 1.7 inhibitors. Bioorg Med Chem Lett25:5419-23 (2015) 
 
Sodium channel protein type 1 subunit alpha
Name:Sodium channel protein type 1 subunit alpha
Type:Protein
Mol. Mass.:228952.47
Organism:Homo sapiens (Human)
Description:P35498
Residue:2009
BDBM50130519
NameBDBM50130519
Synonyms:CHEMBL3634327
TypeSmall organic molecule
Emp. Form.C28H28N2O5
Mol. Mass.472.5323
SMILESOC(COc1ccccc1C(=O)c1ccccc1)CN1CCC(CC1)n1c2ccccc2oc1=O