Reaction Details
TargetSodium channel protein type 9 subunit alpha
LigandBDBM50130520
Substrate/Competitorn/a
Meas. Tech.ChEMBL_1525514 (CHEMBL3636867)
IC50 5000±n/a nM
Citation Suzuki, SKuroda, TKimoto, HDomon, YKubota, KKitano, YYokoyama, TShimizugawa, ASugita, RKoishi, RAsano, DTamaki, KShinozuka, TKobayashi, H Discovery of (phenoxy-2-hydroxypropyl)piperidines as a novel class of voltage-gated sodium channel 1.7 inhibitors. Bioorg Med Chem Lett25:5419-23 (2015) 
 
Sodium channel protein type 9 subunit alpha
Name:Sodium channel protein type 9 subunit alpha
Type:PROTEIN
Mol. Mass.:225808.99
Organism:Mus musculus
Description:ChEMBL_109594
Residue:1984
BDBM50130520
NameBDBM50130520
Synonyms:CHEMBL3634328
TypeSmall organic molecule
Emp. Form.C29H30N2O4
Mol. Mass.470.5595
SMILESOC(COc1ccccc1C(=O)c1ccccc1)CN1CCC(CC1)N1C(=O)Cc2ccccc12