Reaction Details
TargetSodium channel protein type 9 subunit alpha
LigandBDBM50130530
Substrate/Competitorn/a
Meas. Tech.ChEMBL_1525514 (CHEMBL3636867)
IC50 4800±n/a nM
Citation Suzuki, SKuroda, TKimoto, HDomon, YKubota, KKitano, YYokoyama, TShimizugawa, ASugita, RKoishi, RAsano, DTamaki, KShinozuka, TKobayashi, H Discovery of (phenoxy-2-hydroxypropyl)piperidines as a novel class of voltage-gated sodium channel 1.7 inhibitors. Bioorg Med Chem Lett25:5419-23 (2015) 
 
Sodium channel protein type 9 subunit alpha
Name:Sodium channel protein type 9 subunit alpha
Type:PROTEIN
Mol. Mass.:225808.99
Organism:Mus musculus
Description:ChEMBL_109594
Residue:1984
BDBM50130530
NameBDBM50130530
Synonyms:CHEMBL3634337
TypeSmall organic molecule
Emp. Form.C23H25F3N2O3
Mol. Mass.434.4514
SMILESOC(COc1ccccc1C(F)(F)F)CN1CCC(CC1)N1Cc2ccccc2C1=O