Reaction Details
TargetSodium channel protein type 1 subunit alpha [1489-1708]
LigandBDBM50117271
Substrate/Competitorn/a
Meas. Tech.ChEMBL_1525517 (CHEMBL3636870)
IC50 21000±n/a nM
Citation Suzuki, SKuroda, TKimoto, HDomon, YKubota, KKitano, YYokoyama, TShimizugawa, ASugita, RKoishi, RAsano, DTamaki, KShinozuka, TKobayashi, H Discovery of (phenoxy-2-hydroxypropyl)piperidines as a novel class of voltage-gated sodium channel 1.7 inhibitors. Bioorg Med Chem Lett25:5419-23 (2015) 
 
Sodium channel protein type 1 subunit alpha [1489-1708]
Name:Sodium channel protein type 1 subunit alpha [1489-1708]
Type:PROTEIN
Mol. Mass.:25514.04
Organism:Mus musculus
Description:ChEMBL_109872
Residue:220
BDBM50117271
NameBDBM50117271
Synonyms:1-(2,6-dimethylphenoxy)-2-propanolamine 2-(2,6-Dimethyl-phenoxy)-1-methyl-ethylamine CHEMBL558 Mexitil
TypeSmall organic molecule
Emp. Form.C11H17NO
Mol. Mass.179.2588
SMILESCC(N)COc1c(C)cccc1C