Reaction Details
TargetSodium channel protein type 1 subunit alpha [1489-1708]
LigandBDBM50130510
Substrate/Competitorn/a
Meas. Tech.ChEMBL_1525517 (CHEMBL3636870)
IC50 2400±n/a nM
Citation Suzuki, SKuroda, TKimoto, HDomon, YKubota, KKitano, YYokoyama, TShimizugawa, ASugita, RKoishi, RAsano, DTamaki, KShinozuka, TKobayashi, H Discovery of (phenoxy-2-hydroxypropyl)piperidines as a novel class of voltage-gated sodium channel 1.7 inhibitors. Bioorg Med Chem Lett25:5419-23 (2015) 
 
Sodium channel protein type 1 subunit alpha [1489-1708]
Name:Sodium channel protein type 1 subunit alpha [1489-1708]
Type:PROTEIN
Mol. Mass.:25514.04
Organism:Mus musculus
Description:ChEMBL_109872
Residue:220
BDBM50130510
NameBDBM50130510
Synonyms:CHEMBL3632698
TypeSmall organic molecule
Emp. Form.C24H29F3N2O4
Mol. Mass.466.4933
SMILESCOc1cc(ccc1COCC(O)CN1CCC(CC1)C(=O)Nc1ccccc1)C(F)(F)F