Reaction Details
TargetCarbonic anhydrase 12
LigandBDBM50130739
Substrate/Competitorn/a
Meas. Tech.ChEMBL_1524850 (CHEMBL3636832)
Ki 38±n/a nM
Citation Ibrahim, HSAbou-Seri, SMTanc, MElaasser, MMAbdel-Aziz, HASupuran, CT Isatin-pyrazole benzenesulfonamide hybrids potently inhibit tumor-associated carbonic anhydrase isoforms IX and XII. Eur J Med Chem103:583-93 (2015) 
 
Carbonic anhydrase 12
Name:Carbonic anhydrase 12
Type:Enzyme
Mol. Mass.:39456.00
Organism:Homo sapiens (Human)
Description:Catalytic domain of human cloned isozyme was used in the assay
Residue:354
BDBM50130739
NameBDBM50130739
Synonyms:CHEMBL3633549
TypeSmall organic molecule
Emp. Form.C18H15N7O4S
Mol. Mass.425.421
SMILESNc1c(cnn1-c1ccc(cc1)S(N)(=O)=O)C(=O)N\N=C1/C(=O)Nc2ccccc12