Reaction Details
TargetCarbonic anhydrase 9
LigandBDBM50130745
Substrate/Competitorn/a
Meas. Tech.ChEMBL_1524851 (CHEMBL3636833)
Ki 1.1±n/a nM
Citation Ibrahim, HSAbou-Seri, SMTanc, MElaasser, MMAbdel-Aziz, HASupuran, CT Isatin-pyrazole benzenesulfonamide hybrids potently inhibit tumor-associated carbonic anhydrase isoforms IX and XII. Eur J Med Chem103:583-93 (2015) 
 
Carbonic anhydrase 9
Name:Carbonic anhydrase 9
Type:Enzyme
Mol. Mass.:49669.03
Organism:Homo sapiens (Human)
Description:Catalytic domain of human cloned isozyme was used in the assay
Residue:459
BDBM50130745
NameBDBM50130745
Synonyms:CHEMBL3633555
TypeSmall organic molecule
Emp. Form.C15H13N3O3S
Mol. Mass.315.347
SMILESCc1ccc2NC(=O)\C(=N/c3cccc(c3)S(N)(=O)=O)c2c1