Reaction Details
TargetCarbonic anhydrase 12
LigandBDBM50130747
Substrate/Competitorn/a
Meas. Tech.ChEMBL_1524850 (CHEMBL3636832)
Ki 92±n/a nM
Citation Ibrahim, HSAbou-Seri, SMTanc, MElaasser, MMAbdel-Aziz, HASupuran, CT Isatin-pyrazole benzenesulfonamide hybrids potently inhibit tumor-associated carbonic anhydrase isoforms IX and XII. Eur J Med Chem103:583-93 (2015) 
 
Carbonic anhydrase 12
Name:Carbonic anhydrase 12
Type:Enzyme
Mol. Mass.:39456.00
Organism:Homo sapiens (Human)
Description:Catalytic domain of human cloned isozyme was used in the assay
Residue:354
BDBM50130747
NameBDBM50130747
Synonyms:CHEMBL3633379
TypeSmall organic molecule
Emp. Form.C24H18N6O4S
Mol. Mass.486.503
SMILESNS(=O)(=O)c1ccc(cc1)-n1nc(cc1-c1ccccc1)C(=O)N\N=C1/C(=O)Nc2ccccc12