Reaction Details
TargetCarbonic anhydrase 12
LigandBDBM50130748
Substrate/Competitorn/a
Meas. Tech.ChEMBL_1524850 (CHEMBL3636832)
Ki 66±n/a nM
Citation Ibrahim, HSAbou-Seri, SMTanc, MElaasser, MMAbdel-Aziz, HASupuran, CT Isatin-pyrazole benzenesulfonamide hybrids potently inhibit tumor-associated carbonic anhydrase isoforms IX and XII. Eur J Med Chem103:583-93 (2015) 
 
Carbonic anhydrase 12
Name:Carbonic anhydrase 12
Type:Enzyme
Mol. Mass.:39456.00
Organism:Homo sapiens (Human)
Description:Catalytic domain of human cloned isozyme was used in the assay
Residue:354
BDBM50130748
NameBDBM50130748
Synonyms:CHEMBL3633380
TypeSmall organic molecule
Emp. Form.C24H17ClN6O4S
Mol. Mass.520.948
SMILESNS(=O)(=O)c1ccc(cc1)-n1nc(cc1-c1ccccc1)C(=O)N\N=C1/C(=O)Nc2ccc(Cl)cc12